{"text_format":"1","workbook":"xlsx","n_sheets":5,"sheets":["Lists","db","Report 1","Report 2","Report 3"],"not_rendered":{"charts":1,"images":0,"macros":1,"external_links":0,"defined_names":11,"comments":0,"pivot_tables":0},"unopened":[],"bounds":{"document_bytes":16777216,"sheet_cells":100000,"rows_first":2000,"rows_last":500,"rows_between":2000,"halvings":0,"cell_chars":16384,"cell_head_chars":4096},"cells_cut":0,"cells_raw":0,"read":"whole","date_system":"1900"}

{"sheet":"Lists","index":0,"n_rows":20,"n_cols":1,"rows_kept":20,"cut":false,"hidden":false,"merged":[]}
["Genus"]
["Baryonyx"]
["Eustreptospondylus"]
["Megalosaurus"]
["Tyrannosaurus"]
["Albertosaurus"]
["Compsognathus"]
["Ornithomimus"]
["Therizinosaurus"]
["Oviraptor"]
["Microraptor"]
["Deinonychus"]
["Velociraptor"]
["Troodon"]
["Archaeopteryx"]
["Allosaurus"]
["Neovenator"]
["Carcharodontosaurus"]
["Giganotosaurus"]
["Mapusaurus"]
{"$rows_left_out":1}
{"sheet":"db","index":1,"n_rows":96,"n_cols":12,"rows_kept":96,"cut":false,"hidden":false,"merged":[]}
["Month","Genus","Stat 1","Stat 2","Stat 3","Stat 4","Stat 5","Stat 6","Stat 7","Stat 8","Stat 9","Stat 10"]
["2015-01-01","Baryonyx",7,38,46,35,25,110,2300,93045,0.43,319721]
["2015-01-01","Eustreptospondylus",4,9,44,11,31,843,3932,84838,0.42,622204]
["2015-01-01","Megalosaurus",0,2,32,3,106,45,2205,87897,0.18,722912]
["2015-01-01","Tyrannosaurus",4,11,98,18,169,904,2497,52305,0.68,219668]
["2015-01-01","Albertosaurus",7,10,61,212,91,751,3971,88693,0.39,369741]
["2015-01-01","Compsognathus",8,33,21,130,145,67,4659,30316,0.71,836219]
["2015-01-01","Ornithomimus",2,43,94,166,210,434,3970,55778,0.62,8977]
["2015-01-01","Therizinosaurus",4,3,67,31,85,58,714,31449,0.69,823611]
["2015-01-01","Oviraptor",0,4,4,193,180,624,4083,99917,7.0000000000000007E-2,787207]
["2015-01-01","Microraptor",9,41,33,112,157,79,3575,82648,0.4,222545]
["2015-01-01","Deinonychus",7,50,4,165,142,481,1747,27456,0.91,30743]
["2015-01-01","Velociraptor",4,15,84,136,44,103,375,30296,0.59,597851]
["2015-01-01","Troodon",1,13,77,201,178,992,220,97566,0.95,122947]
["2015-01-01","Archaeopteryx",4,16,31,166,85,323,2749,37204,0.04,843087]
["2015-01-01","Allosaurus",5,24,32,166,7,612,1564,72010,0.62,9505]
["2015-01-01","Neovenator",7,41,41,219,173,926,4636,54223,0,252688]
["2015-01-01","Carcharodontosaurus",7,46,1,36,127,134,1336,95478,0.79,293184]
["2015-01-01","Giganotosaurus",3,14,88,164,157,734,1160,90832,0.95,57966]
["2015-01-01","Mapusaurus",3,19,81,104,150,62,768,91621,0.1,646223]
{"$rows_left_out":77}
{"sheet":"Report 1","index":2,"n_rows":21,"n_cols":15,"rows_kept":21,"cut":false,"hidden":false,"merged":[]}
[false,true,true,true,true,true,true,true,true,{"$f":"$E$5=\"Compsognathus\"","v":false},true,true,true,true,true]
[true]
[true,null,{"$f":"\"Stat by Stat Multiplication  |  \"&E5&\"  |  \"&TEXT(E7,\"d/m/y\")&\" to \"&TEXT(E8,\"d/m/y\")","v":"Stat by Stat Multiplication  |  Baryonyx  |  1/1/15 to 1/5/15"}]
[true]
[true,null,null,"Genus","Baryonyx"]
[true]
[true,null,null,"Start Date","2015-01-01"]
[true,null,null,"End Date","2015-05-01"]
[true]
[true,null,null,null,"Stat 1","Stat 2","Stat 3","Stat 4","Stat 5",null,"Stat 6","Stat 7","Stat 8","Stat 9","Stat 10"]
[true,null,null,"Stat 1",{"$f":"IF(E$10=$D11,\"\",SUMIFS(db!C:C,db!$A:$A,\">=\"&$E$7,db!$A:$A,\"<=\"&$E$8,db!$B:$B,$E$5)*SUMIFS(db!$C:$C,db!$A:$A,\">=\"&$E$7,db!$A:$A,\"<=\"&$E$8,db!$B:$B,$E$5))","v":""},{"$f":"IF(F$10=$D11,\"\",SUMIFS(db!D:D,db!$A:$A,\">=\"&$E$7,db!$A:$A,\"<=\"&$E$8,db!$B:$B,$E$5)*SUMIFS(db!$C:$C,db!$A:$A,\">=\"&$E$7,db!$A:$A,\"<=\"&$E$8,db!$B:$B,$E$5))","v":4247},{"$f":"IF(G$10=$D11,\"\",SUMIFS(db!E:E,db!$A:$A,\">=\"&$E$7,db!$A:$A,\"<=\"&$E$8,db!$B:$B,$E$5)*SUMIFS(db!$C:$C,db!$A:$A,\">=\"&$E$7,db!$A:$A,\"<=\"&$E$8,db!$B:$B,$E$5))","v":6479},{"$f":"IF(H$10=$D11,\"\",SUMIFS(db!F:F,db!$A:$A,\">=\"&$E$7,db!$A:$A,\"<=\"&$E$8,db!$B:$B,$E$5)*SUMIFS(db!$C:$C,db!$A:$A,\">=\"&$E$7,db!$A:$A,\"<=\"&$E$8,db!$B:$B,$E$5))","v":13206},{"$f":"IF(I$10=$D11,\"\",SUMIFS(db!G:G,db!$A:$A,\">=\"&$E$7,db!$A:$A,\"<=\"&$E$8,db!$B:$B,$E$5)*SUMIFS(db!$C:$C,db!$A:$A,\">=\"&$E$7,db!$A:$A,\"<=\"&$E$8,db!$B:$B,$E$5))","v":8835},null,{"$f":"IF(K$10=$D11,\"\",SUMIFS(db!H:H,db!$A:$A,\">=\"&$E$7,db!$A:$A,\"<=\"&$E$8,db!$B:$B,$E$5)*SUMIFS(db!$C:$C,db!$A:$A,\">=\"&$E$7,db!$A:$A,\"<=\"&$E$8,db!$B:$B,$E$5))","v":96007},{"$f":"IF(L$10=$D11,\"\",SUMIFS(db!I:I,db!$A:$A,\">=\"&$E$7,db!$A:$A,\"<=\"&$E$8,db!$B:$B,$E$5)*SUMIFS(db!$C:$C,db!$A:$A,\">=\"&$E$7,db!$A:$A,\"<=\"&$E$8,db!$B:$B,$E$5))","v":443579},{"$f":"IF(M$10=$D11,\"\",SUMIFS(db!J:J,db!$A:$A,\">=\"&$E$7,db!$A:$A,\"<=\"&$E$8,db!$B:$B,$E$5)*SUMIFS(db!$C:$C,db!$A:$A,\">=\"&$E$7,db!$A:$A,\"<=\"&$E$8,db!$B:$B,$E$5))","v":9009406},{"$f":"IF(N$10=$D11,\"\",SUMIFS(db!K:K,db!$A:$A,\">=\"&$E$7,db!$A:$A,\"<=\"&$E$8,db!$B:$B,$E$5)*SUMIFS(db!$C:$C,db!$A:$A,\">=\"&$E$7,db!$A:$A,\"<=\"&$E$8,db!$B:$B,$E$5))","v":74.710000000000008},{"$f":"IF(O$10=$D11,\"\",SUMIFS(db!L:L,db!$A:$A,\">=\"&$E$7,db!$A:$A,\"<=\"&$E$8,db!$B:$B,$E$5)*SUMIFS(db!$C:$C,db!$A:$A,\">=\"&$E$7,db!$A:$A,\"<=\"&$E$8,db!$B:$B,$E$5))","v":84430515}]
[true,null,null,"Stat 2",{"$f":"IF(E$10=$D12,\"\",SUMIFS(db!C:C,db!$A:$A,\">=\"&$E$7,db!$A:$A,\"<=\"&$E$8,db!$B:$B,$E$5)*SUMIFS(db!$D:$D,db!$A:$A,\">=\"&$E$7,db!$A:$A,\"<=\"&$E$8,db!$B:$B,$E$5))","v":4247},{"$f":"IF(F$10=$D12,\"\",SUMIFS(db!D:D,db!$A:$A,\">=\"&$E$7,db!$A:$A,\"<=\"&$E$8,db!$B:$B,$E$5)*SUMIFS(db!$D:$D,db!$A:$A,\">=\"&$E$7,db!$A:$A,\"<=\"&$E$8,db!$B:$B,$E$5))","v":""},{"$f":"IF(G$10=$D12,\"\",SUMIFS(db!E:E,db!$A:$A,\">=\"&$E$7,db!$A:$A,\"<=\"&$E$8,db!$B:$B,$E$5)*SUMIFS(db!$D:$D,db!$A:$A,\">=\"&$E$7,db!$A:$A,\"<=\"&$E$8,db!$B:$B,$E$5))","v":28633},{"$f":"IF(H$10=$D12,\"\",SUMIFS(db!F:F,db!$A:$A,\">=\"&$E$7,db!$A:$A,\"<=\"&$E$8,db!$B:$B,$E$5)*SUMIFS(db!$D:$D,db!$A:$A,\">=\"&$E$7,db!$A:$A,\"<=\"&$E$8,db!$B:$B,$E$5))","v":58362},{"$f":"IF(I$10=$D12,\"\",SUMIFS(db!G:G,db!$A:$A,\">=\"&$E$7,db!$A:$A,\"<=\"&$E$8,db!$B:$B,$E$5)*SUMIFS(db!$D:$D,db!$A:$A,\">=\"&$E$7,db!$A:$A,\"<=\"&$E$8,db!$B:$B,$E$5))","v":39045},null,{"$f":"IF(K$10=$D12,\"\",SUMIFS(db!H:H,db!$A:$A,\">=\"&$E$7,db!$A:$A,\"<=\"&$E$8,db!$B:$B,$E$5)*SUMIFS(db!$D:$D,db!$A:$A,\">=\"&$E$7,db!$A:$A,\"<=\"&$E$8,db!$B:$B,$E$5))","v":424289},{"$f":"IF(L$10=$D12,\"\",SUMIFS(db!I:I,db!$A:$A,\">=\"&$E$7,db!$A:$A,\"<=\"&$E$8,db!$B:$B,$E$5)*SUMIFS(db!$D:$D,db!$A:$A,\">=\"&$E$7,db!$A:$A,\"<=\"&$E$8,db!$B:$B,$E$5))","v":1960333},{"$f":"IF(M$10=$D12,\"\",SUMIFS(db!J:J,db!$A:$A,\">=\"&$E$7,db!$A:$A,\"<=\"&$E$8,db!$B:$B,$E$5)*SUMIFS(db!$D:$D,db!$A:$A,\">=\"&$E$7,db!$A:$A,\"<=\"&$E$8,db!$B:$B,$E$5))","v":39815762},{"$f":"IF(N$10=$D12,\"\",SUMIFS(db!K:K,db!$A:$A,\">=\"&$E$7,db!$A:$A,\"<=\"&$E$8,db!$B:$B,$E$5)*SUMIFS(db!$D:$D,db!$A:$A,\">=\"&$E$7,db!$A:$A,\"<=\"&$E$8,db!$B:$B,$E$5))","v":330.17},{"$f":"IF(O$10=$D12,\"\",SUMIFS(db!L:L,db!$A:$A,\">=\"&$E$7,db!$A:$A,\"<=\"&$E$8,db!$B:$B,$E$5)*SUMIFS(db!$D:$D,db!$A:$A,\">=\"&$E$7,db!$A:$A,\"<=\"&$E$8,db!$B:$B,$E$5))","v":373128405}]
[true,null,null,"Stat 3",{"$f":"IF(E$10=$D13,\"\",SUMIFS(db!C:C,db!$A:$A,\">=\"&$E$7,db!$A:$A,\"<=\"&$E$8,db!$B:$B,$E$5)*SUMIFS(db!$E:$E,db!$A:$A,\">=\"&$E$7,db!$A:$A,\"<=\"&$E$8,db!$B:$B,$E$5))","v":6479},{"$f":"IF(F$10=$D13,\"\",SUMIFS(db!D:D,db!$A:$A,\">=\"&$E$7,db!$A:$A,\"<=\"&$E$8,db!$B:$B,$E$5)*SUMIFS(db!$E:$E,db!$A:$A,\">=\"&$E$7,db!$A:$A,\"<=\"&$E$8,db!$B:$B,$E$5))","v":28633},{"$f":"IF(G$10=$D13,\"\",SUMIFS(db!E:E,db!$A:$A,\">=\"&$E$7,db!$A:$A,\"<=\"&$E$8,db!$B:$B,$E$5)*SUMIFS(db!$E:$E,db!$A:$A,\">=\"&$E$7,db!$A:$A,\"<=\"&$E$8,db!$B:$B,$E$5))","v":""},{"$f":"IF(H$10=$D13,\"\",SUMIFS(db!F:F,db!$A:$A,\">=\"&$E$7,db!$A:$A,\"<=\"&$E$8,db!$B:$B,$E$5)*SUMIFS(db!$E:$E,db!$A:$A,\">=\"&$E$7,db!$A:$A,\"<=\"&$E$8,db!$B:$B,$E$5))","v":89034},{"$f":"IF(I$10=$D13,\"\",SUMIFS(db!G:G,db!$A:$A,\">=\"&$E$7,db!$A:$A,\"<=\"&$E$8,db!$B:$B,$E$5)*SUMIFS(db!$E:$E,db!$A:$A,\">=\"&$E$7,db!$A:$A,\"<=\"&$E$8,db!$B:$B,$E$5))","v":59565},null,{"$f":"IF(K$10=$D13,\"\",SUMIFS(db!H:H,db!$A:$A,\">=\"&$E$7,db!$A:$A,\"<=\"&$E$8,db!$B:$B,$E$5)*SUMIFS(db!$E:$E,db!$A:$A,\">=\"&$E$7,db!$A:$A,\"<=\"&$E$8,db!$B:$B,$E$5))","v":647273},{"$f":"IF(L$10=$D13,\"\",SUMIFS(db!I:I,db!$A:$A,\">=\"&$E$7,db!$A:$A,\"<=\"&$E$8,db!$B:$B,$E$5)*SUMIFS(db!$E:$E,db!$A:$A,\">=\"&$E$7,db!$A:$A,\"<=\"&$E$8,db!$B:$B,$E$5))","v":2990581},{"$f":"IF(M$10=$D13,\"\",SUMIFS(db!J:J,db!$A:$A,\">=\"&$E$7,db!$A:$A,\"<=\"&$E$8,db!$B:$B,$E$5)*SUMIFS(db!$E:$E,db!$A:$A,\">=\"&$E$7,db!$A:$A,\"<=\"&$E$8,db!$B:$B,$E$5))","v":60740834},{"$f":"IF(N$10=$D13,\"\",SUMIFS(db!K:K,db!$A:$A,\">=\"&$E$7,db!$A:$A,\"<=\"&$E$8,db!$B:$B,$E$5)*SUMIFS(db!$E:$E,db!$A:$A,\">=\"&$E$7,db!$A:$A,\"<=\"&$E$8,db!$B:$B,$E$5))","v":503.69000000000005},{"$f":"IF(O$10=$D13,\"\",SUMIFS(db!L:L,db!$A:$A,\">=\"&$E$7,db!$A:$A,\"<=\"&$E$8,db!$B:$B,$E$5)*SUMIFS(db!$E:$E,db!$A:$A,\">=\"&$E$7,db!$A:$A,\"<=\"&$E$8,db!$B:$B,$E$5))","v":569225085}]
[true,null,null,"Stat 4",{"$f":"IF(E$10=$D14,\"\",SUMIFS(db!C:C,db!$A:$A,\">=\"&$E$7,db!$A:$A,\"<=\"&$E$8,db!$B:$B,$E$5)*SUMIFS(db!$F:$F,db!$A:$A,\">=\"&$E$7,db!$A:$A,\"<=\"&$E$8,db!$B:$B,$E$5))","v":13206},{"$f":"IF(F$10=$D14,\"\",SUMIFS(db!D:D,db!$A:$A,\">=\"&$E$7,db!$A:$A,\"<=\"&$E$8,db!$B:$B,$E$5)*SUMIFS(db!$F:$F,db!$A:$A,\">=\"&$E$7,db!$A:$A,\"<=\"&$E$8,db!$B:$B,$E$5))","v":58362},{"$f":"IF(G$10=$D14,\"\",SUMIFS(db!E:E,db!$A:$A,\">=\"&$E$7,db!$A:$A,\"<=\"&$E$8,db!$B:$B,$E$5)*SUMIFS(db!$F:$F,db!$A:$A,\">=\"&$E$7,db!$A:$A,\"<=\"&$E$8,db!$B:$B,$E$5))","v":89034},{"$f":"IF(H$10=$D14,\"\",SUMIFS(db!F:F,db!$A:$A,\">=\"&$E$7,db!$A:$A,\"<=\"&$E$8,db!$B:$B,$E$5)*SUMIFS(db!$F:$F,db!$A:$A,\">=\"&$E$7,db!$A:$A,\"<=\"&$E$8,db!$B:$B,$E$5))","v":""},{"$f":"IF(I$10=$D14,\"\",SUMIFS(db!G:G,db!$A:$A,\">=\"&$E$7,db!$A:$A,\"<=\"&$E$8,db!$B:$B,$E$5)*SUMIFS(db!$F:$F,db!$A:$A,\">=\"&$E$7,db!$A:$A,\"<=\"&$E$8,db!$B:$B,$E$5))","v":121410},null,{"$f":"IF(K$10=$D14,\"\",SUMIFS(db!H:H,db!$A:$A,\">=\"&$E$7,db!$A:$A,\"<=\"&$E$8,db!$B:$B,$E$5)*SUMIFS(db!$F:$F,db!$A:$A,\">=\"&$E$7,db!$A:$A,\"<=\"&$E$8,db!$B:$B,$E$5))","v":1319322},{"$f":"IF(L$10=$D14,\"\",SUMIFS(db!I:I,db!$A:$A,\">=\"&$E$7,db!$A:$A,\"<=\"&$E$8,db!$B:$B,$E$5)*SUMIFS(db!$F:$F,db!$A:$A,\">=\"&$E$7,db!$A:$A,\"<=\"&$E$8,db!$B:$B,$E$5))","v":6095634},{"$f":"IF(M$10=$D14,\"\",SUMIFS(db!J:J,db!$A:$A,\">=\"&$E$7,db!$A:$A,\"<=\"&$E$8,db!$B:$B,$E$5)*SUMIFS(db!$F:$F,db!$A:$A,\">=\"&$E$7,db!$A:$A,\"<=\"&$E$8,db!$B:$B,$E$5))","v":123806676},{"$f":"IF(N$10=$D14,\"\",SUMIFS(db!K:K,db!$A:$A,\">=\"&$E$7,db!$A:$A,\"<=\"&$E$8,db!$B:$B,$E$5)*SUMIFS(db!$F:$F,db!$A:$A,\">=\"&$E$7,db!$A:$A,\"<=\"&$E$8,db!$B:$B,$E$5))","v":1026.6600000000001},{"$f":"IF(O$10=$D14,\"\",SUMIFS(db!L:L,db!$A:$A,\">=\"&$E$7,db!$A:$A,\"<=\"&$E$8,db!$B:$B,$E$5)*SUMIFS(db!$F:$F,db!$A:$A,\">=\"&$E$7,db!$A:$A,\"<=\"&$E$8,db!$B:$B,$E$5))","v":1160238690}]
[true,null,null,"Stat 5",{"$f":"IF(E$10=$D15,\"\",SUMIFS(db!C:C,db!$A:$A,\">=\"&$E$7,db!$A:$A,\"<=\"&$E$8,db!$B:$B,$E$5)*SUMIFS(db!$G:$G,db!$A:$A,\">=\"&$E$7,db!$A:$A,\"<=\"&$E$8,db!$B:$B,$E$5))","v":8835},{"$f":"IF(F$10=$D15,\"\",SUMIFS(db!D:D,db!$A:$A,\">=\"&$E$7,db!$A:$A,\"<=\"&$E$8,db!$B:$B,$E$5)*SUMIFS(db!$G:$G,db!$A:$A,\">=\"&$E$7,db!$A:$A,\"<=\"&$E$8,db!$B:$B,$E$5))","v":39045},{"$f":"IF(G$10=$D15,\"\",SUMIFS(db!E:E,db!$A:$A,\">=\"&$E$7,db!$A:$A,\"<=\"&$E$8,db!$B:$B,$E$5)*SUMIFS(db!$G:$G,db!$A:$A,\">=\"&$E$7,db!$A:$A,\"<=\"&$E$8,db!$B:$B,$E$5))","v":59565},{"$f":"IF(H$10=$D15,\"\",SUMIFS(db!F:F,db!$A:$A,\">=\"&$E$7,db!$A:$A,\"<=\"&$E$8,db!$B:$B,$E$5)*SUMIFS(db!$G:$G,db!$A:$A,\">=\"&$E$7,db!$A:$A,\"<=\"&$E$8,db!$B:$B,$E$5))","v":121410},{"$f":"IF(I$10=$D15,\"\",SUMIFS(db!G:G,db!$A:$A,\">=\"&$E$7,db!$A:$A,\"<=\"&$E$8,db!$B:$B,$E$5)*SUMIFS(db!$G:$G,db!$A:$A,\">=\"&$E$7,db!$A:$A,\"<=\"&$E$8,db!$B:$B,$E$5))","v":""},null,{"$f":"IF(K$10=$D15,\"\",SUMIFS(db!H:H,db!$A:$A,\">=\"&$E$7,db!$A:$A,\"<=\"&$E$8,db!$B:$B,$E$5)*SUMIFS(db!$G:$G,db!$A:$A,\">=\"&$E$7,db!$A:$A,\"<=\"&$E$8,db!$B:$B,$E$5))","v":882645},{"$f":"IF(L$10=$D15,\"\",SUMIFS(db!I:I,db!$A:$A,\">=\"&$E$7,db!$A:$A,\"<=\"&$E$8,db!$B:$B,$E$5)*SUMIFS(db!$G:$G,db!$A:$A,\">=\"&$E$7,db!$A:$A,\"<=\"&$E$8,db!$B:$B,$E$5))","v":4078065},{"$f":"IF(M$10=$D15,\"\",SUMIFS(db!J:J,db!$A:$A,\">=\"&$E$7,db!$A:$A,\"<=\"&$E$8,db!$B:$B,$E$5)*SUMIFS(db!$G:$G,db!$A:$A,\">=\"&$E$7,db!$A:$A,\"<=\"&$E$8,db!$B:$B,$E$5))","v":82828410},{"$f":"IF(N$10=$D15,\"\",SUMIFS(db!K:K,db!$A:$A,\">=\"&$E$7,db!$A:$A,\"<=\"&$E$8,db!$B:$B,$E$5)*SUMIFS(db!$G:$G,db!$A:$A,\">=\"&$E$7,db!$A:$A,\"<=\"&$E$8,db!$B:$B,$E$5))","v":686.85},{"$f":"IF(O$10=$D15,\"\",SUMIFS(db!L:L,db!$A:$A,\">=\"&$E$7,db!$A:$A,\"<=\"&$E$8,db!$B:$B,$E$5)*SUMIFS(db!$G:$G,db!$A:$A,\">=\"&$E$7,db!$A:$A,\"<=\"&$E$8,db!$B:$B,$E$5))","v":776216025}]
[{"$f":"$E$5=\"Compsognathus\"","v":false}]
[true,null,null,"Stat 6",{"$f":"IF(E$10=$D17,\"\",SUMIFS(db!C:C,db!$A:$A,\">=\"&$E$7,db!$A:$A,\"<=\"&$E$8,db!$B:$B,$E$5)*SUMIFS(db!$H:$H,db!$A:$A,\">=\"&$E$7,db!$A:$A,\"<=\"&$E$8,db!$B:$B,$E$5))","v":96007},{"$f":"IF(F$10=$D17,\"\",SUMIFS(db!D:D,db!$A:$A,\">=\"&$E$7,db!$A:$A,\"<=\"&$E$8,db!$B:$B,$E$5)*SUMIFS(db!$H:$H,db!$A:$A,\">=\"&$E$7,db!$A:$A,\"<=\"&$E$8,db!$B:$B,$E$5))","v":424289},{"$f":"IF(G$10=$D17,\"\",SUMIFS(db!E:E,db!$A:$A,\">=\"&$E$7,db!$A:$A,\"<=\"&$E$8,db!$B:$B,$E$5)*SUMIFS(db!$H:$H,db!$A:$A,\">=\"&$E$7,db!$A:$A,\"<=\"&$E$8,db!$B:$B,$E$5))","v":647273},{"$f":"IF(H$10=$D17,\"\",SUMIFS(db!F:F,db!$A:$A,\">=\"&$E$7,db!$A:$A,\"<=\"&$E$8,db!$B:$B,$E$5)*SUMIFS(db!$H:$H,db!$A:$A,\">=\"&$E$7,db!$A:$A,\"<=\"&$E$8,db!$B:$B,$E$5))","v":1319322},{"$f":"IF(I$10=$D17,\"\",SUMIFS(db!G:G,db!$A:$A,\">=\"&$E$7,db!$A:$A,\"<=\"&$E$8,db!$B:$B,$E$5)*SUMIFS(db!$H:$H,db!$A:$A,\">=\"&$E$7,db!$A:$A,\"<=\"&$E$8,db!$B:$B,$E$5))","v":882645},null,{"$f":"IF(K$10=$D17,\"\",SUMIFS(db!H:H,db!$A:$A,\">=\"&$E$7,db!$A:$A,\"<=\"&$E$8,db!$B:$B,$E$5)*SUMIFS(db!$H:$H,db!$A:$A,\">=\"&$E$7,db!$A:$A,\"<=\"&$E$8,db!$B:$B,$E$5))","v":""},{"$f":"IF(L$10=$D17,\"\",SUMIFS(db!I:I,db!$A:$A,\">=\"&$E$7,db!$A:$A,\"<=\"&$E$8,db!$B:$B,$E$5)*SUMIFS(db!$H:$H,db!$A:$A,\">=\"&$E$7,db!$A:$A,\"<=\"&$E$8,db!$B:$B,$E$5))","v":44314973},{"$f":"IF(M$10=$D17,\"\",SUMIFS(db!J:J,db!$A:$A,\">=\"&$E$7,db!$A:$A,\"<=\"&$E$8,db!$B:$B,$E$5)*SUMIFS(db!$H:$H,db!$A:$A,\">=\"&$E$7,db!$A:$A,\"<=\"&$E$8,db!$B:$B,$E$5))","v":900068722},{"$f":"IF(N$10=$D17,\"\",SUMIFS(db!K:K,db!$A:$A,\">=\"&$E$7,db!$A:$A,\"<=\"&$E$8,db!$B:$B,$E$5)*SUMIFS(db!$H:$H,db!$A:$A,\">=\"&$E$7,db!$A:$A,\"<=\"&$E$8,db!$B:$B,$E$5))","v":7463.77},{"$f":"IF(O$10=$D17,\"\",SUMIFS(db!L:L,db!$A:$A,\">=\"&$E$7,db!$A:$A,\"<=\"&$E$8,db!$B:$B,$E$5)*SUMIFS(db!$H:$H,db!$A:$A,\">=\"&$E$7,db!$A:$A,\"<=\"&$E$8,db!$B:$B,$E$5))","v":8434880805}]
[true,null,null,"Stat 7",{"$f":"IF(E$10=$D18,\"\",SUMIFS(db!C:C,db!$A:$A,\">=\"&$E$7,db!$A:$A,\"<=\"&$E$8,db!$B:$B,$E$5)*SUMIFS(db!$I:$I,db!$A:$A,\">=\"&$E$7,db!$A:$A,\"<=\"&$E$8,db!$B:$B,$E$5))","v":443579},{"$f":"IF(F$10=$D18,\"\",SUMIFS(db!D:D,db!$A:$A,\">=\"&$E$7,db!$A:$A,\"<=\"&$E$8,db!$B:$B,$E$5)*SUMIFS(db!$I:$I,db!$A:$A,\">=\"&$E$7,db!$A:$A,\"<=\"&$E$8,db!$B:$B,$E$5))","v":1960333},{"$f":"IF(G$10=$D18,\"\",SUMIFS(db!E:E,db!$A:$A,\">=\"&$E$7,db!$A:$A,\"<=\"&$E$8,db!$B:$B,$E$5)*SUMIFS(db!$I:$I,db!$A:$A,\">=\"&$E$7,db!$A:$A,\"<=\"&$E$8,db!$B:$B,$E$5))","v":2990581},{"$f":"IF(H$10=$D18,\"\",SUMIFS(db!F:F,db!$A:$A,\">=\"&$E$7,db!$A:$A,\"<=\"&$E$8,db!$B:$B,$E$5)*SUMIFS(db!$I:$I,db!$A:$A,\">=\"&$E$7,db!$A:$A,\"<=\"&$E$8,db!$B:$B,$E$5))","v":6095634},{"$f":"IF(I$10=$D18,\"\",SUMIFS(db!G:G,db!$A:$A,\">=\"&$E$7,db!$A:$A,\"<=\"&$E$8,db!$B:$B,$E$5)*SUMIFS(db!$I:$I,db!$A:$A,\">=\"&$E$7,db!$A:$A,\"<=\"&$E$8,db!$B:$B,$E$5))","v":4078065},null,{"$f":"IF(K$10=$D18,\"\",SUMIFS(db!H:H,db!$A:$A,\">=\"&$E$7,db!$A:$A,\"<=\"&$E$8,db!$B:$B,$E$5)*SUMIFS(db!$I:$I,db!$A:$A,\">=\"&$E$7,db!$A:$A,\"<=\"&$E$8,db!$B:$B,$E$5))","v":44314973},{"$f":"IF(L$10=$D18,\"\",SUMIFS(db!I:I,db!$A:$A,\">=\"&$E$7,db!$A:$A,\"<=\"&$E$8,db!$B:$B,$E$5)*SUMIFS(db!$I:$I,db!$A:$A,\">=\"&$E$7,db!$A:$A,\"<=\"&$E$8,db!$B:$B,$E$5))","v":""},{"$f":"IF(M$10=$D18,\"\",SUMIFS(db!J:J,db!$A:$A,\">=\"&$E$7,db!$A:$A,\"<=\"&$E$8,db!$B:$B,$E$5)*SUMIFS(db!$I:$I,db!$A:$A,\">=\"&$E$7,db!$A:$A,\"<=\"&$E$8,db!$B:$B,$E$5))","v":4158567434},{"$f":"IF(N$10=$D18,\"\",SUMIFS(db!K:K,db!$A:$A,\">=\"&$E$7,db!$A:$A,\"<=\"&$E$8,db!$B:$B,$E$5)*SUMIFS(db!$I:$I,db!$A:$A,\">=\"&$E$7,db!$A:$A,\"<=\"&$E$8,db!$B:$B,$E$5))","v":34484.69},{"$f":"IF(O$10=$D18,\"\",SUMIFS(db!L:L,db!$A:$A,\">=\"&$E$7,db!$A:$A,\"<=\"&$E$8,db!$B:$B,$E$5)*SUMIFS(db!$I:$I,db!$A:$A,\">=\"&$E$7,db!$A:$A,\"<=\"&$E$8,db!$B:$B,$E$5))","v":38971491585}]
[true,null,null,"Stat 8",{"$f":"IF(E$10=$D19,\"\",SUMIFS(db!C:C,db!$A:$A,\">=\"&$E$7,db!$A:$A,\"<=\"&$E$8,db!$B:$B,$E$5)*SUMIFS(db!$J:$J,db!$A:$A,\">=\"&$E$7,db!$A:$A,\"<=\"&$E$8,db!$B:$B,$E$5))","v":9009406},{"$f":"IF(F$10=$D19,\"\",SUMIFS(db!D:D,db!$A:$A,\">=\"&$E$7,db!$A:$A,\"<=\"&$E$8,db!$B:$B,$E$5)*SUMIFS(db!$J:$J,db!$A:$A,\">=\"&$E$7,db!$A:$A,\"<=\"&$E$8,db!$B:$B,$E$5))","v":39815762},{"$f":"IF(G$10=$D19,\"\",SUMIFS(db!E:E,db!$A:$A,\">=\"&$E$7,db!$A:$A,\"<=\"&$E$8,db!$B:$B,$E$5)*SUMIFS(db!$J:$J,db!$A:$A,\">=\"&$E$7,db!$A:$A,\"<=\"&$E$8,db!$B:$B,$E$5))","v":60740834},{"$f":"IF(H$10=$D19,\"\",SUMIFS(db!F:F,db!$A:$A,\">=\"&$E$7,db!$A:$A,\"<=\"&$E$8,db!$B:$B,$E$5)*SUMIFS(db!$J:$J,db!$A:$A,\">=\"&$E$7,db!$A:$A,\"<=\"&$E$8,db!$B:$B,$E$5))","v":123806676},{"$f":"IF(I$10=$D19,\"\",SUMIFS(db!G:G,db!$A:$A,\">=\"&$E$7,db!$A:$A,\"<=\"&$E$8,db!$B:$B,$E$5)*SUMIFS(db!$J:$J,db!$A:$A,\">=\"&$E$7,db!$A:$A,\"<=\"&$E$8,db!$B:$B,$E$5))","v":82828410},null,{"$f":"IF(K$10=$D19,\"\",SUMIFS(db!H:H,db!$A:$A,\">=\"&$E$7,db!$A:$A,\"<=\"&$E$8,db!$B:$B,$E$5)*SUMIFS(db!$J:$J,db!$A:$A,\">=\"&$E$7,db!$A:$A,\"<=\"&$E$8,db!$B:$B,$E$5))","v":900068722},{"$f":"IF(L$10=$D19,\"\",SUMIFS(db!I:I,db!$A:$A,\">=\"&$E$7,db!$A:$A,\"<=\"&$E$8,db!$B:$B,$E$5)*SUMIFS(db!$J:$J,db!$A:$A,\">=\"&$E$7,db!$A:$A,\"<=\"&$E$8,db!$B:$B,$E$5))","v":4158567434},{"$f":"IF(M$10=$D19,\"\",SUMIFS(db!J:J,db!$A:$A,\">=\"&$E$7,db!$A:$A,\"<=\"&$E$8,db!$B:$B,$E$5)*SUMIFS(db!$J:$J,db!$A:$A,\">=\"&$E$7,db!$A:$A,\"<=\"&$E$8,db!$B:$B,$E$5))","v":""},{"$f":"IF(N$10=$D19,\"\",SUMIFS(db!K:K,db!$A:$A,\">=\"&$E$7,db!$A:$A,\"<=\"&$E$8,db!$B:$B,$E$5)*SUMIFS(db!$J:$J,db!$A:$A,\">=\"&$E$7,db!$A:$A,\"<=\"&$E$8,db!$B:$B,$E$5))","v":700408.66},{"$f":"IF(O$10=$D19,\"\",SUMIFS(db!L:L,db!$A:$A,\">=\"&$E$7,db!$A:$A,\"<=\"&$E$8,db!$B:$B,$E$5)*SUMIFS(db!$J:$J,db!$A:$A,\">=\"&$E$7,db!$A:$A,\"<=\"&$E$8,db!$B:$B,$E$5))","v":791538801690}]
[true,null,null,"Stat 9",{"$f":"IF(E$10=$D20,\"\",SUMIFS(db!C:C,db!$A:$A,\">=\"&$E$7,db!$A:$A,\"<=\"&$E$8,db!$B:$B,$E$5)*SUMIFS(db!$K:$K,db!$A:$A,\">=\"&$E$7,db!$A:$A,\"<=\"&$E$8,db!$B:$B,$E$5))","v":74.710000000000008},{"$f":"IF(F$10=$D20,\"\",SUMIFS(db!D:D,db!$A:$A,\">=\"&$E$7,db!$A:$A,\"<=\"&$E$8,db!$B:$B,$E$5)*SUMIFS(db!$K:$K,db!$A:$A,\">=\"&$E$7,db!$A:$A,\"<=\"&$E$8,db!$B:$B,$E$5))","v":330.17},{"$f":"IF(G$10=$D20,\"\",SUMIFS(db!E:E,db!$A:$A,\">=\"&$E$7,db!$A:$A,\"<=\"&$E$8,db!$B:$B,$E$5)*SUMIFS(db!$K:$K,db!$A:$A,\">=\"&$E$7,db!$A:$A,\"<=\"&$E$8,db!$B:$B,$E$5))","v":503.69000000000005},{"$f":"IF(H$10=$D20,\"\",SUMIFS(db!F:F,db!$A:$A,\">=\"&$E$7,db!$A:$A,\"<=\"&$E$8,db!$B:$B,$E$5)*SUMIFS(db!$K:$K,db!$A:$A,\">=\"&$E$7,db!$A:$A,\"<=\"&$E$8,db!$B:$B,$E$5))","v":1026.6600000000001},{"$f":"IF(I$10=$D20,\"\",SUMIFS(db!G:G,db!$A:$A,\">=\"&$E$7,db!$A:$A,\"<=\"&$E$8,db!$B:$B,$E$5)*SUMIFS(db!$K:$K,db!$A:$A,\">=\"&$E$7,db!$A:$A,\"<=\"&$E$8,db!$B:$B,$E$5))","v":686.85},null,{"$f":"IF(K$10=$D20,\"\",SUMIFS(db!H:H,db!$A:$A,\">=\"&$E$7,db!$A:$A,\"<=\"&$E$8,db!$B:$B,$E$5)*SUMIFS(db!$K:$K,db!$A:$A,\">=\"&$E$7,db!$A:$A,\"<=\"&$E$8,db!$B:$B,$E$5))","v":7463.77},{"$f":"IF(L$10=$D20,\"\",SUMIFS(db!I:I,db!$A:$A,\">=\"&$E$7,db!$A:$A,\"<=\"&$E$8,db!$B:$B,$E$5)*SUMIFS(db!$K:$K,db!$A:$A,\">=\"&$E$7,db!$A:$A,\"<=\"&$E$8,db!$B:$B,$E$5))","v":34484.69},{"$f":"IF(M$10=$D20,\"\",SUMIFS(db!J:J,db!$A:$A,\">=\"&$E$7,db!$A:$A,\"<=\"&$E$8,db!$B:$B,$E$5)*SUMIFS(db!$K:$K,db!$A:$A,\">=\"&$E$7,db!$A:$A,\"<=\"&$E$8,db!$B:$B,$E$5))","v":700408.66},{"$f":"IF(N$10=$D20,\"\",SUMIFS(db!K:K,db!$A:$A,\">=\"&$E$7,db!$A:$A,\"<=\"&$E$8,db!$B:$B,$E$5)*SUMIFS(db!$K:$K,db!$A:$A,\">=\"&$E$7,db!$A:$A,\"<=\"&$E$8,db!$B:$B,$E$5))","v":""},{"$f":"IF(O$10=$D20,\"\",SUMIFS(db!L:L,db!$A:$A,\">=\"&$E$7,db!$A:$A,\"<=\"&$E$8,db!$B:$B,$E$5)*SUMIFS(db!$K:$K,db!$A:$A,\">=\"&$E$7,db!$A:$A,\"<=\"&$E$8,db!$B:$B,$E$5))","v":6563791.6500000004}]
{"$rows_left_out":2}
{"sheet":"Report 2","index":3,"n_rows":22,"n_cols":6,"rows_kept":22,"cut":false,"hidden":false,"merged":[]}
[false,true,true,true,{"$f":"$F$5=\"Compsognathus\"","v":false},true]
[true]
[true,null,{"$f":"\"Stat Totals  |  \"&F5&\"  |  \"&TEXT(F7,\"d/m/y\")&\" to \"&TEXT(F8,\"d/m/y\")","v":"Stat Totals  |  Baryonyx  |  1/1/15 to 1/5/15"}]
[true]
[true,null,null,"Genus",null,"Baryonyx"]
[true]
[true,null,null,"Start Date",null,"2015-01-01"]
[true,null,null,"End Date",null,"2015-05-01"]
[true]
[true]
[true,null,null,"Stat",null,"Total"]
[true,null,null,"Stat 1",null,{"$f":"SUMIFS(db!$C:$C,db!$A:$A,\">=\"&$F$7,db!$A:$A,\"<=\"&$F$8,db!$B:$B,$F$5)","v":31}]
[true,null,null,"Stat 2",null,{"$f":"SUMIFS(db!$D:$D,db!$A:$A,\">=\"&$F$7,db!$A:$A,\"<=\"&$F$8,db!$B:$B,$F$5)","v":137}]
[true,null,null,"Stat 3",null,{"$f":"SUMIFS(db!$E:$E,db!$A:$A,\">=\"&$F$7,db!$A:$A,\"<=\"&$F$8,db!$B:$B,$F$5)","v":209}]
[true,null,null,"Stat 4",null,{"$f":"SUMIFS(db!$F:$F,db!$A:$A,\">=\"&$F$7,db!$A:$A,\"<=\"&$F$8,db!$B:$B,$F$5)","v":426}]
[true,null,null,"Stat 5",null,{"$f":"SUMIFS(db!$G:$G,db!$A:$A,\">=\"&$F$7,db!$A:$A,\"<=\"&$F$8,db!$B:$B,$F$5)","v":285}]
[{"$f":"$F$5=\"Compsognathus\"","v":false}]
[true,null,null,"Stat 6",null,{"$f":"SUMIFS(db!$H:$H,db!$A:$A,\">=\"&$F$7,db!$A:$A,\"<=\"&$F$8,db!$B:$B,$F$5)","v":3097}]
[true,null,null,"Stat 7",null,{"$f":"SUMIFS(db!$I:$I,db!$A:$A,\">=\"&$F$7,db!$A:$A,\"<=\"&$F$8,db!$B:$B,$F$5)","v":14309}]
[true,null,null,"Stat 8",null,{"$f":"SUMIFS(db!$J:$J,db!$A:$A,\">=\"&$F$7,db!$A:$A,\"<=\"&$F$8,db!$B:$B,$F$5)","v":290626}]
{"$rows_left_out":3}
{"sheet":"Report 3","index":4,"n_rows":29,"n_cols":10,"rows_kept":29,"cut":false,"hidden":false,"merged":[]}
[false,true,true,true,true,{"$f":"$E$5=\"Compsognathus\"","v":false},true,true,true,true]
[true]
[true,null,{"$f":"\"Monthly Stat Trending  |  \"&E5&\"  |  \"&TEXT(E7,\"d/m/y\")&\" to \"&TEXT(E8,\"d/m/y\")","v":"Monthly Stat Trending  |  Baryonyx  |  1/1/15 to 1/5/15"}]
[true]
[true,null,null,"Genus","Baryonyx"]
[true]
[true,null,null,"Start Date","2015-01-01"]
[true,null,null,"End Date","2015-05-01"]
[true]
[true]
[true,null,null,null,{"$f":"E7","v":"2015-01-01"},null,{"$f":"IF(DATE(YEAR(E11),MONTH(E11)+1,1)<=$E$8,DATE(YEAR(E11),MONTH(E11)+1,1),NA())","v":"2015-02-01"},{"$f":"IF(DATE(YEAR(G11),MONTH(G11)+1,1)<=$E$8,DATE(YEAR(G11),MONTH(G11)+1,1),NA())","v":"2015-03-01"},{"$f":"IF(DATE(YEAR(H11),MONTH(H11)+1,1)<=$E$8,DATE(YEAR(H11),MONTH(H11)+1,1),NA())","v":"2015-04-01"},{"$f":"IF(DATE(YEAR(I11),MONTH(I11)+1,1)<=$E$8,DATE(YEAR(I11),MONTH(I11)+1,1),NA())","v":"2015-05-01"}]
[true,null,null,"Stat 4",{"$f":"SUMIFS(db!$F:$F,db!$A:$A,E$11,db!$B:$B,$E$5)","v":35},null,{"$f":"SUMIFS(db!$F:$F,db!$A:$A,G$11,db!$B:$B,$E$5)","v":223},{"$f":"SUMIFS(db!$F:$F,db!$A:$A,H$11,db!$B:$B,$E$5)","v":65},{"$f":"SUMIFS(db!$F:$F,db!$A:$A,I$11,db!$B:$B,$E$5)","v":39},{"$f":"SUMIFS(db!$F:$F,db!$A:$A,J$11,db!$B:$B,$E$5)","v":64}]
[{"$f":"$E$5=\"Compsognathus\"","v":false}]
[true,null,null,"Stat 5",{"$f":"SUMIFS(db!$G:$G,db!$A:$A,E$11,db!$B:$B,$E$5)","v":25},null,{"$f":"SUMIFS(db!$G:$G,db!$A:$A,G$11,db!$B:$B,$E$5)","v":25},{"$f":"SUMIFS(db!$G:$G,db!$A:$A,H$11,db!$B:$B,$E$5)","v":3},{"$f":"SUMIFS(db!$G:$G,db!$A:$A,I$11,db!$B:$B,$E$5)","v":115},{"$f":"SUMIFS(db!$G:$G,db!$A:$A,J$11,db!$B:$B,$E$5)","v":117}]
[true]
[true]
[true]
[true]
[true]
[true]
{"$rows_left_out":9}